{"text_format":"1","workbook":"xlsx","n_sheets":6,"sheets":["Startovní listina","Výsledky kat.A","Výsledky kat.B","Výsledky družstev","Výpočty družstev","přihlášky"],"not_rendered":{"charts":0,"images":2,"macros":1,"external_links":0,"defined_names":4,"comments":0,"pivot_tables":0},"unopened":[],"bounds":{"document_bytes":16777216,"sheet_cells":100000,"rows_first":2000,"rows_last":500,"rows_between":2000,"halvings":0,"cell_chars":16384,"cell_head_chars":4096},"cells_cut":0,"cells_raw":0,"read":"whole","date_system":"1900"}

{"sheet":"Startovní listina","index":0,"n_rows":41,"n_cols":22,"rows_kept":41,"cut":false,"hidden":false,"merged":[[0,0,0,11],[1,0,1,11],[4,0,5,0],[4,1,5,1],[4,2,5,2],[4,3,5,3],[4,10,5,10],[4,11,5,11],[4,4,4,9],[3,3,3,11],[3,0,3,1],[2,0,2,11]]}
["Krajská soutěž v TFA "]
["HZS Jihočeského kraje"]
["Startovní Listina"]
["Datum: 13. září 2013",null,null,"Místo soutěže: areál Aktiv parku Lipno  - Stezka korunami stromů"]
["Start. č.","Jméno","ÚO","Kat.","Trestné sek.",null,null,null,null,null,"Dosažený čas","Celkový čas"]
[null,null,null,null,"Zjevné odhození proudnic místo jejich položení (20s)","Odlož. palice nebo závaží mimo ozn. prostor (20s)","Nenapojení nebo upadnutí proudnice z monitoru (20s)","Přečnívající hadice přes půdorys boxu (20s)","Odhoz. figuríny (20s)","Nepřek. bariéry (60s)",null,null,"kategorie","20s","20s","20s","20s","20s","60s","součet","č.družstva"]
[1,{"$f":"přihlášky!$E$17","v":0},{"$f":"přihlášky!C7","v":"České Budějovice"},{"$f":"přihlášky!F17","v":"A"},null,null,null,null,null,null,null,{"$f":"IF(K7+T7=0,\"diskval.\",K7+T7)","v":"diskval."},{"$f":"IF(D7=\"A\",1,IF(D7=\"B\",2,\"chyba\"))","v":1},{"$f":"IF(E7=\"x\",\"00:00:20\",\"00:00:00\")","v":"00:00:00"},{"$f":"IF(F7=\"x\",\"00:00:20\",\"00:00:00\")","v":"00:00:00"},"00:00:00","00:00:00","00:00:00",{"$f":"IF(J7=\"x\",\"00:01:00\",\"00:00:00\")","v":"00:00:00"},{"$f":"N7+O7+P7+Q7+R7+S7","v":"00:00:00"},1,"00:05:38.864"]
[2,{"$f":"přihlášky!$E$30","v":"Pavel Vejvara"},{"$f":"přihlášky!C8","v":"Český Krumlov"},{"$f":"přihlášky!F30","v":"A"},null,null,null,null,null,"x","00:05:38.864",{"$f":"IF(K8+T8=0,\"diskval.\",K8+T8)","v":"00:06:38.864"},{"$f":"IF(D8=\"A\",1,IF(D8=\"B\",2,\"chyba\"))","v":1},{"$f":"IF(E8=\"x\",\"00:00:20\",\"00:00:00\")","v":"00:00:00"},{"$f":"IF(F8=\"x\",\"00:00:20\",\"00:00:00\")","v":"00:00:00"},{"$f":"IF(G8=\"x\",\"00:00:20\",\"00:00:00\")","v":"00:00:00"},{"$f":"IF(H8=\"x\",\"00:00:20\",\"00:00:00\")","v":"00:00:00"},{"$f":"IF(I8=\"x\",\"00:00:20\",\"00:00:00\")","v":"00:00:00"},{"$f":"IF(J8=\"x\",\"00:01:00\",\"00:00:00\")","v":"00:01:00"},{"$f":"N8+O8+P8+Q8+R8+S8","v":"00:01:00"},2]
[3,{"$f":"přihlášky!$E$43","v":"Stanislav Stiebler"},{"$f":"přihlášky!C9","v":"Prachatice"},{"$f":"přihlášky!F43","v":"A"},null,null,null,null,null,"x","00:09:57.683","00:10:57.683",1,"00:00:00","00:00:00","00:00:00","00:00:00","00:00:00","00:01:00","00:01:00",3]
[4,{"$f":"přihlášky!$E$56","v":"David Kubiš"},{"$f":"přihlášky!C10","v":"Písek"},{"$f":"přihlášky!F56","v":"A"},null,null,null,null,null,null,"00:05:03.560","00:05:03.560",1,"00:00:00","00:00:00","00:00:00","00:00:00","00:00:00","00:00:00","00:00:00",4]
[5,{"$f":"přihlášky!$E$69","v":"Karel Sokol "},{"$f":"přihlášky!C11","v":"Strakonice"},{"$f":"přihlášky!F69","v":"B"},null,null,null,null,null,null,"00:06:10.584","00:06:10.584",2,"00:00:00","00:00:00","00:00:00","00:00:00","00:00:00","00:00:00","00:00:00",5]
[6,{"$f":"přihlášky!$E$82","v":"Stanislav Šmíd"},{"$f":"přihlášky!C12","v":"Jindřichův Hradec"},{"$f":"přihlášky!F82","v":"A"},null,null,null,null,null,null,"00:06:34.039","00:06:34.039",1,"00:00:00","00:00:00","00:00:00","00:00:00","00:00:00","00:00:00","00:00:00",6]
[7,{"$f":"přihlášky!$E$95","v":"Ondřej Fišer"},{"$f":"přihlášky!C13","v":"Tábor"},{"$f":"přihlášky!F95","v":"A"},null,null,null,null,null,null,"00:05:08.750","00:05:08.750",1,"00:00:00","00:00:00","00:00:00","00:00:00","00:00:00","00:00:00","00:00:00",7]
[8,{"$f":"přihlášky!$E$18","v":"Petr Habeš "},{"$f":"přihlášky!C7","v":"České Budějovice"},{"$f":"přihlášky!F18","v":"B"},null,null,null,null,null,null,"00:06:34.754","00:06:34.754",2,"00:00:00","00:00:00","00:00:00","00:00:00","00:00:00","00:00:00","00:00:00",1]
[9,{"$f":"přihlášky!$E$31","v":"Tomáš Kubeš"},{"$f":"přihlášky!C8","v":"Český Krumlov"},{"$f":"přihlášky!F31","v":"A"},null,null,null,null,null,null,"00:05:40.778","00:05:40.778",1,"00:00:00","00:00:00","00:00:00","00:00:00","00:00:00","00:00:00","00:00:00",2]
[10,{"$f":"přihlášky!$E$44","v":"Fulín Jiří"},{"$f":"přihlášky!C9","v":"Prachatice"},{"$f":"přihlášky!F44","v":"B"},null,null,null,null,null,null,"00:07:25.991","00:07:25.991",2,"00:00:00","00:00:00","00:00:00","00:00:00","00:00:00","00:00:00","00:00:00",3]
[11,{"$f":"přihlášky!$E$57","v":"Karel Tratina"},{"$f":"přihlášky!C10","v":"Písek"},{"$f":"přihlášky!F57","v":"A"},null,null,null,null,null,null,"00:05:54.766","00:05:54.766",1,"00:00:00","00:00:00","00:00:00","00:00:00","00:00:00","00:00:00","00:00:00",4]
[12,{"$f":"přihlášky!$E$70","v":"Jindřich Králík"},{"$f":"přihlášky!C11","v":"Strakonice"},{"$f":"přihlášky!F70","v":"B"},null,null,null,null,null,null,"00:06:39.686","00:06:39.686",2,"00:00:00","00:00:00","00:00:00","00:00:00","00:00:00","00:00:00","00:00:00",5]
[13,{"$f":"přihlášky!$E$83","v":"Jaroslav Poukar "},{"$f":"přihlášky!C12","v":"Jindřichův Hradec"},{"$f":"přihlášky!F83","v":"A"},null,null,null,null,null,null,"00:04:55.555","00:04:55.555",1,"00:00:00","00:00:00","00:00:00","00:00:00","00:00:00","00:00:00","00:00:00",6]
[14,{"$f":"přihlášky!$E$96","v":"Michal Podzimek"},{"$f":"přihlášky!C13","v":"Tábor"},{"$f":"přihlášky!F96","v":"B"},null,null,null,null,null,null,"00:05:47.185","00:05:47.185",2,"00:00:00","00:00:00","00:00:00","00:00:00","00:00:00","00:00:00","00:00:00",7]
[15,{"$f":"přihlášky!$E$19","v":"Jakub Kostohryz "},{"$f":"přihlášky!C7","v":"České Budějovice"},{"$f":"přihlášky!F19","v":"A"},null,null,null,null,null,null,"00:06:00.288","00:06:00.288",1,"00:00:00","00:00:00","00:00:00","00:00:00","00:00:00","00:00:00","00:00:00",1]
[16,{"$f":"přihlášky!$E$32","v":"Jiří Mleziva"},{"$f":"přihlášky!C8","v":"Český Krumlov"},{"$f":"přihlášky!F32","v":"B"},null,null,null,null,null,null,"00:07:11.351","00:07:11.351",2,"00:00:00","00:00:00","00:00:00","00:00:00","00:00:00","00:00:00","00:00:00",2]
[17,{"$f":"přihlášky!$E$45","v":"Haubelt Jiří"},{"$f":"přihlášky!C9","v":"Prachatice"},{"$f":"přihlášky!F45","v":"B"},null,null,null,null,null,null,"00:11:30.904","00:11:30.904",2,"00:00:00","00:00:00","00:00:00","00:00:00","00:00:00","00:00:00","00:00:00",3]
[18,{"$f":"přihlášky!$E$58","v":"Michal Brousil"},{"$f":"přihlášky!C10","v":"Písek"},{"$f":"přihlášky!F58","v":"A"},null,null,null,null,null,null,"00:05:37.682","00:05:37.682",1,"00:00:00","00:00:00","00:00:00","00:00:00","00:00:00","00:00:00","00:00:00",4]
[19,{"$f":"přihlášky!$E$71","v":"Oldřich Pecka"},{"$f":"přihlášky!C11","v":"Strakonice"},{"$f":"přihlášky!F71","v":"B"},null,null,null,null,null,null,"00:07:21.734","00:07:21.734",2,"00:00:00","00:00:00","00:00:00","00:00:00","00:00:00","00:00:00","00:00:00",5]
[20,{"$f":"přihlášky!$E$84","v":"Pavel Brůžek "},{"$f":"přihlášky!C12","v":"Jindřichův Hradec"},{"$f":"přihlášky!F84","v":"A"},null,null,null,null,null,null,"00:05:46.116","00:05:46.116",1,"00:00:00","00:00:00","00:00:00","00:00:00","00:00:00","00:00:00","00:00:00",6]
[21,{"$f":"přihlášky!$E$97","v":"Lukáš Houdek"},{"$f":"přihlášky!C13","v":"Tábor"},{"$f":"přihlášky!F97","v":"A"},null,null,null,null,null,null,"00:05:00.318","00:05:00.318",1,"00:00:00","00:00:00","00:00:00","00:00:00","00:00:00","00:00:00","00:00:00",7]
[22,{"$f":"přihlášky!$E$20","v":"Petr Švepeš "},{"$f":"přihlášky!C7","v":"České Budějovice"},{"$f":"přihlášky!F20","v":"A"},null,null,null,null,null,null,"00:05:31.009","00:05:31.009",1,"00:00:00","00:00:00","00:00:00","00:00:00","00:00:00","00:00:00","00:00:00",1]
[23,{"$f":"přihlášky!$E$33","v":"Václav Ottenschlager"},{"$f":"přihlášky!C8","v":"Český Krumlov"},{"$f":"přihlášky!F33","v":"A"},null,null,null,null,null,"x","00:06:37.228","00:07:37.228",1,"00:00:00","00:00:00","00:00:00","00:00:00","00:00:00","00:01:00","00:01:00",2]
[24,{"$f":"přihlášky!$E$46","v":"Pecka Petr"},{"$f":"přihlášky!C9","v":"Prachatice"},{"$f":"přihlášky!F46","v":"B"},null,null,null,null,null,null,"00:05:26.318","00:05:26.318",2,"00:00:00","00:00:00","00:00:00","00:00:00","00:00:00","00:00:00","00:00:00",3]
[25,{"$f":"přihlášky!$E$59","v":"Tomáš Novotný"},{"$f":"přihlášky!C10","v":"Písek"},{"$f":"přihlášky!F59","v":"A"},null,null,null,null,null,null,"00:05:14.557","00:05:14.557",1,"00:00:00","00:00:00","00:00:00","00:00:00","00:00:00","00:00:00","00:00:00",4]
[26,{"$f":"přihlášky!$E$72","v":"Michal Habich"},{"$f":"přihlášky!C11","v":"Strakonice"},{"$f":"přihlášky!F72","v":"A"},null,null,null,null,null,null,"00:06:06.384","00:06:06.384",1,"00:00:00","00:00:00","00:00:00","00:00:00","00:00:00","00:00:00","00:00:00",5]
[27,{"$f":"přihlášky!$E$85","v":0},{"$f":"přihlášky!C12","v":"Jindřichův Hradec"},{"$f":"přihlášky!F85","v":"B"},null,null,null,null,null,null,null,"diskval.",2,"00:00:00","00:00:00","00:00:00","00:00:00","00:00:00","00:00:00","00:00:00",6]
[28,{"$f":"přihlášky!$E$98","v":"Petr Klůfa"},{"$f":"přihlášky!C13","v":"Tábor"},{"$f":"přihlášky!F98","v":"B"},null,null,null,null,null,null,"00:05:34.873","00:05:34.873",2,"00:00:00","00:00:00","00:00:00","00:00:00","00:00:00","00:00:00","00:00:00",7]
[29,{"$f":"přihlášky!$E$21","v":"Milan Čada "},{"$f":"přihlášky!C7","v":"České Budějovice"},{"$f":"přihlášky!F21","v":"A"},null,null,null,null,null,null,"00:04:57.476","00:04:57.476",1,"00:00:00","00:00:00","00:00:00","00:00:00","00:00:00","00:00:00","00:00:00",1]
[30,{"$f":"přihlášky!$E$34","v":"Milan Líbal"},{"$f":"přihlášky!C8","v":"Český Krumlov"},{"$f":"přihlášky!F34","v":"B"},null,null,null,null,null,null,"00:06:08.822","00:06:08.822",2,"00:00:00","00:00:00","00:00:00","00:00:00","00:00:00","00:00:00","00:00:00",2]
[31,{"$f":"přihlášky!$E$47","v":"Roučka Milan"},{"$f":"přihlášky!C9","v":"Prachatice"},{"$f":"přihlášky!F47","v":"B"},null,null,null,null,null,null,"00:06:48.329","00:06:48.329",2,"00:00:00","00:00:00","00:00:00","00:00:00","00:00:00","00:00:00","00:00:00",3]
[32,{"$f":"přihlášky!$E$60","v":"Stanislav Smrt"},{"$f":"přihlášky!C10","v":"Písek"},{"$f":"přihlášky!F60","v":"A"},null,null,null,null,null,"x","00:07:22.480","00:08:22.480",1,"00:00:00","00:00:00","00:00:00","00:00:00","00:00:00","00:01:00","00:01:00",4]
[33,{"$f":"přihlášky!$E$73","v":"Vratislav Zelenka"},{"$f":"přihlášky!C11","v":"Strakonice"},{"$f":"přihlášky!F73","v":"A"},null,null,null,null,null,null,"00:06:48.218","00:06:48.218",1,"00:00:00","00:00:00","00:00:00","00:00:00","00:00:00","00:00:00","00:00:00",5]
[34,{"$f":"přihlášky!$E$86","v":0},{"$f":"přihlášky!C12","v":"Jindřichův Hradec"},{"$f":"přihlášky!F86","v":"B"},null,null,null,null,null,null,null,"diskval.",2,"00:00:00","00:00:00","00:00:00","00:00:00","00:00:00","00:00:00","00:00:00",6]
[35,{"$f":"přihlášky!$E$99","v":"Petr Benda"},{"$f":"přihlášky!C13","v":"Tábor"},{"$f":"přihlášky!F99","v":"B"},null,null,null,null,null,null,"00:05:23.762","00:05:23.762",2,"00:00:00","00:00:00","00:00:00","00:00:00","00:00:00","00:00:00","00:00:00",7]

{"sheet":"Výsledky kat.A","index":1,"n_rows":43,"n_cols":7,"rows_kept":43,"cut":false,"hidden":false,"merged":[[1,0,1,9],[0,0,0,9],[2,0,2,9],[3,0,3,3],[3,4,3,9]]}
["Krajská soutěž v TFA "]
["HZS Jihočeského kraje"]
["Výsledky kategorie \"A\""]
["Datum: 13. září 2013",null,null,null,"Místo soutěže: areál Aktiv parku Lipno  - Stezka korunami stromů"]
[null,"Pořadí",null,"Start. č.","Jméno","ÚO","Celkový čas"]
[null,1,null,13,"Jaroslav Poukar ","Jindřichův Hradec","00:04:55.555"]
[null,2,null,29,"Milan Čada ","České Budějovice","00:04:57.476"]
[null,3,null,21,"Lukáš Houdek","Tábor","00:05:00.318"]
[null,4,null,4,"David Kubiš","Písek","00:05:03.560"]
[null,5,null,7,"Ondřej Fišer","Tábor","00:05:08.750"]
[null,6,null,25,"Tomáš Novotný","Písek","00:05:14.557"]
[null,7,null,22,"Petr Švepeš ","České Budějovice","00:05:31.009"]
[null,8,null,18,"Michal Brousil","Písek","00:05:37.682"]
[null,9,null,9,"Tomáš Kubeš","Český Krumlov","00:05:40.778"]
[null,10,null,20,"Pavel Brůžek ","Jindřichův Hradec","00:05:46.116"]
[null,11,null,11,"Karel Tratina","Písek","00:05:54.766"]
[null,12,null,15,"Jakub Kostohryz ","České Budějovice","00:06:00.288"]
[null,13,null,26,"Michal Habich","Strakonice","00:06:06.384"]
[null,14,null,6,"Stanislav Šmíd","Jindřichův Hradec","00:06:34.039"]
[null,15,null,2,"Pavel Vejvara","Český Krumlov","00:06:38.864"]
[null,16,null,33,"Vratislav Zelenka","Strakonice","00:06:48.218"]
[null,17,null,23,"Václav Ottenschlager","Český Krumlov","00:07:37.228"]
[null,18,null,32,"Stanislav Smrt","Písek","00:08:22.480"]
[null,19,null,3,"Stanislav Stiebler","Prachatice","00:10:57.683"]
[null,20,null,1,0,"České Budějovice","diskval."]
[null,21]
[null,22]
[null,23]
[null,24]
[null,25]
[null,26]
[null,27]
[null,28]
[null,29]
[null,30]
[null,31]
[null,32]
[null,33]
[null,34]
[null,35]
[]
["Jméno hl. rozhodčího: Bc. Martin Škulina"]
["Podpis: …………………."]

{"sheet":"Výsledky kat.B","index":2,"n_rows":43,"n_cols":7,"rows_kept":43,"cut":false,"hidden":false,"merged":[[0,0,0,9],[1,0,1,9],[2,0,2,9],[3,0,3,3],[3,4,3,9]]}
["Krajská soutěž v TFA "]
["HZS Jihočeského kraje"]
["Výsledky kategorie \"B\""]
["Datum: 13. září 2013",null,null,null,"Místo soutěže: areál Aktiv parku Lipno  - Stezka korunami stromů"]
[null,"Pořadí",null,"Start. č.","Jméno","ÚO","Celkový čas"]
[null,1,null,35,"Petr Benda","Tábor","00:05:23.762"]
[null,2,null,24,"Pecka Petr","Prachatice","00:05:26.318"]
[null,3,null,28,"Petr Klůfa","Tábor","00:05:34.873"]
[null,4,null,14,"Michal Podzimek","Tábor","00:05:47.185"]
[null,5,null,30,"Milan Líbal","Český Krumlov","00:06:08.822"]
[null,6,null,5,"Karel Sokol ","Strakonice","00:06:10.584"]
[null,7,null,8,"Petr Habeš ","České Budějovice","00:06:34.754"]
[null,8,null,12,"Jindřich Králík","Strakonice","00:06:39.686"]
[null,9,null,31,"Roučka Milan","Prachatice","00:06:48.329"]
[null,10,null,16,"Jiří Mleziva","Český Krumlov","00:07:11.351"]
[null,11,null,19,"Oldřich Pecka","Strakonice","00:07:21.734"]
[null,12,null,10,"Fulín Jiří","Prachatice","00:07:25.991"]
[null,13,null,17,"Haubelt Jiří","Prachatice","00:11:30.904"]
[null,14,null,27,0,"Jindřichův Hradec","diskval."]
[null,15,null,34,0,"Jindřichův Hradec","diskval."]
[null,16]
[null,17]
[null,18]
[null,19]
[null,20]
[null,21]
[null,22]
[null,23]
[null,24]
[null,25]
[null,26]
[null,27]
[null,28]
[null,29]
[null,30]
[null,31]
[null,32]
[null,33]
[null,34]
[null,35]
[]
["Jméno hl. rozhodčího: Bc. Martin Škulina"]
["Podpis: …………………."]

{"sheet":"Výsledky družstev","index":3,"n_rows":16,"n_cols":7,"rows_kept":16,"cut":false,"hidden":false,"merged":[[4,3,4,5],[0,0,0,9],[1,0,1,9],[2,0,2,9],[3,0,3,3],[3,4,3,9]]}
["Krajská soutěž v TFA "]
["HZS Jihočeského kraje"]
["Výsledky družstev"]
["Datum: 13. září 2013",null,null,null,"Místo soutěže: areál Aktiv parku Lipno  - Stezka korunami stromů"]
[null,"Pořadí",null,"ÚO",null,null,"Celkový čas"]
[null,1,null,{"$f":"přihlášky!C13","v":"Tábor"},null,null,{"$f":"'Výpočty družstev'!E47","v":"00:15:32.830"}]
[null,2,null,{"$f":"přihlášky!C10","v":"Písek"},null,null,{"$f":"'Výpočty družstev'!E26","v":"00:15:55.799"}]
[null,3,null,{"$f":"přihlášky!C7","v":"České Budějovice"},null,null,{"$f":"'Výpočty družstev'!E5","v":"00:16:28.773"}]
[null,4,null,{"$f":"přihlášky!C12","v":"Jindřichův Hradec"},null,null,{"$f":"'Výpočty družstev'!E40","v":"00:17:15.710"}]
[null,5,null,{"$f":"přihlášky!C8","v":"Český Krumlov"},null,null,{"$f":"'Výpočty družstev'!E12","v":"00:18:28.464"}]
[null,6,null,{"$f":"přihlášky!C11","v":"Strakonice"},null,null,{"$f":"'Výpočty družstev'!E33","v":"00:18:56.654"}]
[null,7,null,{"$f":"přihlášky!C9","v":"Prachatice"},null,null,{"$f":"'Výpočty družstev'!E19","v":"00:19:40.638"}]
[]
[]
["Jméno hl. rozhodčího: Bc. Martin Škulina"]
["Podpis: …………………."]

{"sheet":"Výpočty družstev","index":4,"n_rows":49,"n_cols":5,"rows_kept":49,"cut":false,"hidden":false,"merged":[[43,1,43,2],[22,1,22,2],[29,1,29,2],[36,1,36,2],[1,1,1,2],[8,1,8,2],[15,1,15,2]]}
[]
[null,{"$f":"přihlášky!C7","v":"České Budějovice"}]
[29,"Milan Čada ","České Budějovice","00:04:57.476"]
[22,"Petr Švepeš ","České Budějovice","00:05:31.009"]
[15,"Jakub Kostohryz ","České Budějovice","00:06:00.288",{"$f":"D3+D4+D5","v":"00:16:28.773"}]
[8,"Petr Habeš ","České Budějovice","00:06:34.754"]
[1,0,"České Budějovice","diskval."]
[]
[null,{"$f":"přihlášky!C8","v":"Český Krumlov"}]
[9,"Tomáš Kubeš","Český Krumlov","00:05:40.778"]
[30,"Milan Líbal","Český Krumlov","00:06:08.822"]
[2,"Pavel Vejvara","Český Krumlov","00:06:38.864",{"$f":"D10+D11+D12","v":"00:18:28.464"}]
[16,"Jiří Mleziva","Český Krumlov","00:07:11.351"]
[23,"Václav Ottenschlager","Český Krumlov","00:07:37.228"]
[]
[null,{"$f":"přihlášky!C9","v":"Prachatice"}]
[24,"Pecka Petr","Prachatice","00:05:26.318"]
[31,"Roučka Milan","Prachatice","00:06:48.329"]
[10,"Fulín Jiří","Prachatice","00:07:25.991",{"$f":"D17+D18+D19","v":"00:19:40.638"}]
[3,"Stanislav Stiebler","Prachatice","00:10:57.683"]
[17,"Haubelt Jiří","Prachatice","00:11:30.904"]
[]
[null,{"$f":"přihlášky!C10","v":"Písek"}]
[4,"David Kubiš","Písek","00:05:03.560"]
[25,"Tomáš Novotný","Písek","00:05:14.557"]
[18,"Michal Brousil","Písek","00:05:37.682",{"$f":"D24+D25+D26","v":"00:15:55.799"}]
[11,"Karel Tratina","Písek","00:05:54.766"]
[32,"Stanislav Smrt","Písek","00:08:22.480"]
[]
[null,{"$f":"přihlášky!C11","v":"Strakonice"}]
[26,"Michal Habich","Strakonice","00:06:06.384"]
[5,"Karel Sokol ","Strakonice","00:06:10.584"]
[12,"Jindřich Králík","Strakonice","00:06:39.686",{"$f":"D31+D32+D33","v":"00:18:56.654"}]
[33,"Vratislav Zelenka","Strakonice","00:06:48.218"]
[19,"Oldřich Pecka","Strakonice","00:07:21.734"]
[]
[null,{"$f":"přihlášky!C12","v":"Jindřichův Hradec"}]
[13,"Jaroslav Poukar ","Jindřichův Hradec","00:04:55.555"]
[20,"Pavel Brůžek ","Jindřichův Hradec","00:05:46.116"]
[6,"Stanislav Šmíd","Jindřichův Hradec","00:06:34.039",{"$f":"D38+D39+D40","v":"00:17:15.710"}]
[27,0,"Jindřichův Hradec","diskval."]
[34,0,"Jindřichův Hradec","diskval."]
[]
[null,{"$f":"přihlášky!C13","v":"Tábor"}]
[21,"Lukáš Houdek","Tábor","00:05:00.318"]
[7,"Ondřej Fišer","Tábor","00:05:08.750"]
[35,"Petr Benda","Tábor","00:05:23.762",{"$f":"D45+D46+D47","v":"00:15:32.830"}]
[28,"Petr Klůfa","Tábor","00:05:34.873"]
[14,"Michal Podzimek","Tábor","00:05:47.185"]

{"sheet":"přihlášky","index":5,"n_rows":104,"n_cols":7,"rows_kept":104,"cut":false,"hidden":false,"merged":[[5,1,5,2]]}
[]
[]
[]
[null,null,"Počet Družstev",7]
[]
[null,"Pořadí družstev ÚO"]
[null,1,"České Budějovice"]
[null,2,"Český Krumlov"]
[null,3,"Prachatice"]
[null,4,"Písek"]
[null,5,"Strakonice"]
[null,6,"Jindřichův Hradec"]
[null,7,"Tábor"]
[null,8]
[null,9,null,1,{"$f":"C7","v":"České Budějovice"}]
[null,10,null,"start.č.","Jméno","kategorie","rok narození"]
[null,null,null,{"$f":"D15","v":1},null,{"$f":"IF((2013-G17)<=34,\"A\",\"B\")","v":"A"},1986]
[null,null,null,{"$f":"D17+D4","v":8},"Petr Habeš ",{"$f":"IF((2013-G18)<=34,\"A\",\"B\")","v":"B"},1976]
[null,null,null,{"$f":"D18+D4","v":15},"Jakub Kostohryz ","A",1984]
[null,null,null,{"$f":"D19+D4","v":22},"Petr Švepeš ","A",1981]
[null,null,null,{"$f":"D20+D4","v":29},"Milan Čada ",{"$f":"IF((2013-G21)<=34,\"A\",\"B\")","v":"A"},1983]
[null,null,null,{"$f":"D21+D4","v":36}]
[null,null,null,{"$f":"D22+D4","v":43}]
[null,null,null,{"$f":"D23+D4","v":50}]
[null,null,null,{"$f":"D24+D4","v":57}]
[null,null,null,{"$f":"D25+D4","v":64}]
[]
[null,null,null,2,{"$f":"C8","v":"Český Krumlov"}]
[null,null,null,"start.č.","Jméno","kategorie","rok narození"]
[null,null,null,{"$f":"D28","v":2},"Pavel Vejvara",{"$f":"IF((2013-G30)<=34,\"A\",\"B\")","v":"A"},1979]
[null,null,null,{"$f":"D30+D4","v":9},"Tomáš Kubeš",{"$f":"IF((2013-G31)<=34,\"A\",\"B\")","v":"A"},1979]
[null,null,null,{"$f":"D31+D4","v":16},"Jiří Mleziva","B",1974]
[null,null,null,{"$f":"D32+D4","v":23},"Václav Ottenschlager","A",1986]
[null,null,null,{"$f":"D33+D4","v":30},"Milan Líbal","B",1975]
[null,null,null,{"$f":"D34+D4","v":37}]
[null,null,null,{"$f":"D35+D4","v":44}]
[null,null,null,{"$f":"D36+D4","v":51}]
[null,null,null,{"$f":"D37+D4","v":58}]
[null,null,null,{"$f":"D38+D4","v":65}]
[]
[null,null,null,3,{"$f":"C9","v":"Prachatice"}]
[null,null,null,"start.č.","Jméno","kategorie","rok narození"]
[null,null,null,{"$f":"D41","v":3},"Stanislav Stiebler",{"$f":"IF((2013-G43)<=34,\"A\",\"B\")","v":"A"},1980]
[null,null,null,{"$f":"D43+D4","v":10},"Fulín Jiří",{"$f":"IF((2013-G44)<=34,\"A\",\"B\")","v":"B"},1973]
[null,null,null,{"$f":"D44+D4","v":17},"Haubelt Jiří","B",1976]
[null,null,null,{"$f":"D45+D4","v":24},"Pecka Petr","B",1971]
[null,null,null,{"$f":"D46+D4","v":31},"Roučka Milan","B",1974]
[null,null,null,{"$f":"D47+D4","v":38}]
[null,null,null,{"$f":"D48+D4","v":45}]
[null,null,null,{"$f":"D49+D4","v":52}]
[null,null,null,{"$f":"D50+D4","v":59}]
[null,null,null,{"$f":"D51+D4","v":66}]
[]
[null,null,null,4,{"$f":"C10","v":"Písek"}]
[null,null,null,"start.č.","Jméno","kategorie","rok narození"]
[null,null,null,{"$f":"D54","v":4},"David Kubiš",{"$f":"IF((2013-G56)<=34,\"A\",\"B\")","v":"A"},1979]
[null,null,null,{"$f":"D56+D4","v":11},"Karel Tratina",{"$f":"IF((2013-G57)<=34,\"A\",\"B\")","v":"A"},1988]
[null,null,null,{"$f":"D57+D4","v":18},"Michal Brousil","A",1989]
[null,null,null,{"$f":"D58+D4","v":25},"Tomáš Novotný","A",1985]
[null,null,null,{"$f":"D59+D4","v":32},"Stanislav Smrt","A",1984]
[null,null,null,{"$f":"D60+D4","v":39}]
[null,null,null,{"$f":"D61+D4","v":46}]
[null,null,null,{"$f":"D62+D4","v":53}]
[null,null,null,{"$f":"D63+D4","v":60}]
[null,null,null,{"$f":"D64+D4","v":67}]
[]
[null,null,null,5,{"$f":"C11","v":"Strakonice"}]
[null,null,null,"start.č.","Jméno","kategorie","rok narození"]
[null,null,null,{"$f":"D67","v":5},"Karel Sokol ",{"$f":"IF((2013-G69)<=34,\"A\",\"B\")","v":"B"},1975]
[null,null,null,{"$f":"D69+D4","v":12},"Jindřich Králík",{"$f":"IF((2013-G70)<=34,\"A\",\"B\")","v":"B"},1976]
[null,null,null,{"$f":"D70+D4","v":19},"Oldřich Pecka","B",1975]
[null,null,null,{"$f":"D71+D4","v":26},"Michal Habich","A",1989]
[null,null,null,{"$f":"D72+D4","v":33},"Vratislav Zelenka","A",1982]
[null,null,null,{"$f":"D73+D4","v":40}]
[null,null,null,{"$f":"D74+D4","v":47}]
[null,null,null,{"$f":"D75+D4","v":54}]
[null,null,null,{"$f":"D76+D4","v":61}]
[null,null,null,{"$f":"D77+D4","v":68}]
[]
[null,null,null,6,{"$f":"C12","v":"Jindřichův Hradec"}]
[null,null,null,"start.č.","Jméno","kategorie","rok narození"]
[null,null,null,{"$f":"D80","v":6},"Stanislav Šmíd",{"$f":"IF((2013-G82)<=34,\"A\",\"B\")","v":"A"},1986]
[null,null,null,{"$f":"D82+D4","v":13},"Jaroslav Poukar ",{"$f":"IF((2013-G83)<=34,\"A\",\"B\")","v":"A"},1988]
[null,null,null,{"$f":"D83+D4","v":20},"Pavel Brůžek ","A",1984]
[null,null,null,{"$f":"D84+D4","v":27},null,"B"]
[null,null,null,{"$f":"D85+D4","v":34},null,"B"]
[null,null,null,{"$f":"D86+D4","v":41}]
[null,null,null,{"$f":"D87+D4","v":48}]
[null,null,null,{"$f":"D88+D4","v":55}]
[null,null,null,{"$f":"D89+D4","v":62}]
[null,null,null,{"$f":"D90+D4","v":69}]
[]
[null,null,null,7,{"$f":"C13","v":"Tábor"}]
[null,null,null,"start.č.","Jméno","kategorie","rok narození"]
[null,null,null,{"$f":"D93","v":7},"Ondřej Fišer",{"$f":"IF((2013-G95)<=34,\"A\",\"B\")","v":"A"},1987]
[null,null,null,{"$f":"D95+D4","v":14},"Michal Podzimek",{"$f":"IF((2013-G96)<=34,\"A\",\"B\")","v":"B"},1975]
[null,null,null,{"$f":"D96+D4","v":21},"Lukáš Houdek","A",1982]
[null,null,null,{"$f":"D97+D4","v":28},"Petr Klůfa","B",1970]
[null,null,null,{"$f":"D98+D4","v":35},"Petr Benda","B",1978]
[null,null,null,{"$f":"D99+D4","v":42}]
[null,null,null,{"$f":"D100+D4","v":49}]
[null,null,null,{"$f":"D101+D4","v":56}]
[null,null,null,{"$f":"D102+D4","v":63}]
[null,null,null,{"$f":"D103+D4","v":70}]